ARDrone SDK 2.0 on Ubuntu 16.04 (64 btis)


#1

Reading the developer guide I have seen that this SDK is only operational with 32 bits OS. Therefore, my question is the following: Is there any way to launch this SDK in Ubuntu 16.04 (64 bits)?

Furthermore, I have tried to get it work, but when I want to compile the sdk_demo example I get the following error:

root@xxxx:/home/xxxx/ARDrone_SDK_2_0_1/Examples/Linux/sdk_demo/Build# make
Libs already extracted
Building target static
Architecture x86_64 is already built
Creating universal static lib file from architectures x86_64
Build done.
Building ARDroneTool/Lib
Building ARDroneTool/Lib
ld ardrone_testing_tool
../../Soft/Build/targets_versions/linux_sdk_demo_PROD_MODE_vlib_Linux_4.4.0-31-generic_GNU_Linux_usrbingcc_5.4.0/Navdata/navdata.o:(.data+0x80): undefined reference to `demo_navdata_client_init'
../../Soft/Build/targets_versions/linux_sdk_demo_PROD_MODE_vlib_Linux_4.4.0-31-generic_GNU_Linux_usrbingcc_5.4.0/Navdata/navdata.o:(.data+0x88): undefined reference to `demo_navdata_client_process'
../../Soft/Build/targets_versions/linux_sdk_demo_PROD_MODE_vlib_Linux_4.4.0-31-generic_GNU_Linux_usrbingcc_5.4.0/Navdata/navdata.o:(.data+0x90): undefined reference to `demo_navdata_client_release'
collect2: error: ld returned 1 exit status
generic.makefile:136: recipe for target '/home/xxxx/ARDrone_SDK_2_0_1/Examples/Linux/sdk_demo/Build/../../Build/Release/ardrone_testing_tool' failed
make[3]: *** [/home/xxxx/ARDrone_SDK_2_0_1/Examples/Linux/sdk_demo/Build/../../Build/Release/ardrone_testing_tool] Error 1
app.makefile:33: recipe for target 'all' failed
make[2]: *** [all] Error 2
Makefile:163: recipe for target 'build_app' failed
make[1]: *** [build_app] Error 2
Makefile:76: recipe for target 'linux_sdk_demo' failed
make: *** [linux_sdk_demo] Error 2
root@xxxx:/home/xxxx/ARDrone_SDK_2_0_1/Examples/Linux/sdk_demo/Build# 

Any suggestion???


#2

I have the same problem but haven’t find the solution. Did you get over the problem?


#3

Same problem here.
Any suggestion?


#4

Hi,

Same here.
Some news ?


#5

Hi. I’m still with this problem. any Advance, please put in here =)