Errors on SDK Parrot software


#1

11m

Hi, I’m a French student working on a project in UK for 2 months, I have to control a Parrot Drone with the SDK software on Linus. I a begginer on Linux so I have some problems. I have tried to test some of the examples located in ~/Documents/ARDrone_SDK_2_0_1/ARDrone_SDK_2_0_1/Examples/Linux but i don’t succed.
For example when I try to “make” the Makefile of sdk_demo some errors appear :slight_smile:
Building ARDroneTool/Lib
ld ardrone_testing_tool
…/…/Soft/Build/targets_versions/linux_sdk_demo_PROD_MODE_vlib_Linux_4.10.0-19-generic_GNU_Linux_usrbingcc_6.3.0/Navdata/navdata.o:(.data.rel+0x80) : référence indéfinie vers « demo_navdata_client_init »
…/…/Soft/Build/targets_versions/linux_sdk_demo_PROD_MODE_vlib_Linux_4.10.0-19-generic_GNU_Linux_usrbingcc_6.3.0/Navdata/navdata.o:(.data.rel+0x88) : référence indéfinie vers « demo_navdata_client_process »
…/…/Soft/Build/targets_versions/linux_sdk_demo_PROD_MODE_vlib_Linux_4.10.0-19-generic_GNU_Linux_usrbingcc_6.3.0/Navdata/navdata.o:(.data.rel+0x90) : référence indéfinie vers « demo_navdata_client_release »
collect2: error: ld returned 1 exit status
generic.makefile:136 : la recette pour la cible « /home/vernet/Documents/ARDrone_SDK_2_0_1/ARDrone_SDK_2_0_1/Examples/Linux/sdk_demo/Build/…/…/Build/Release/ardrone_testing_tool » a échouée
make[3]: *** [/home/vernet/Documents/ARDrone_SDK_2_0_1/ARDrone_SDK_2_0_1/Examples/Linux/sdk_demo/Build/…/…/Build/Release/ardrone_testing_tool] Erreur 1
app.makefile:33 : la recette pour la cible « all » a échouée
make[2]: *** [all] Erreur 2
Makefile:163 : la recette pour la cible « build_app » a échouée
make[1]: *** [build_app] Erreur 2
Makefile:70 : la recette pour la cible « linux_sdk_demo » a échouée
make: *** [linux_sdk_demo] Erreur 2

Can you help me please?

VERNET R.